{"text_format":"1","workbook":"xlsx","n_sheets":12,"sheets":["Control","AUX2","Net42","Net41","Net32","Net31","Net22","Net21","Net12","Net11","AUX","specs"],"not_rendered":{"charts":0,"images":553,"macros":1,"external_links":0,"defined_names":2,"comments":0,"pivot_tables":0},"unopened":[],"bounds":{"document_bytes":16777216,"sheet_cells":100000,"rows_first":2000,"rows_last":500,"rows_between":2000,"halvings":0,"cell_chars":16384,"cell_head_chars":4096},"cells_cut":0,"cells_raw":0,"read":"whole","date_system":"1900"}

{"sheet":"Control","index":0,"n_rows":0,"n_cols":0,"rows_kept":0,"cut":false,"hidden":false,"merged":[]}

{"sheet":"AUX2","index":1,"n_rows":54,"n_cols":22,"rows_kept":54,"cut":false,"hidden":true,"merged":[[3,15,3,16],[47,0,51,17],[20,0,20,1]]}
[{"$f":"'Net42'!B1+'Net41'!B1+'Net32'!B1+'Net31'!B1+'Net22'!B1+'Net21'!B1+'Net12'!B1+'Net11'!B1+SUM(A7:A18)","v":0},"Vtriac(vba)",1.5,{"$f":"+'Net11'!D1+'Net12'!D1+'Net21'!D1+'Net22'!D1+'Net31'!D1+'Net32'!D1+'Net41'!D1+'Net42'!D1","v":0},null,null,null,null,null,null,null,null,null,null,null,null,null,null,null,null,"V0",1]
[null,null,{"$f":"+C5*1","v":60},null,null,null,null,null,null,"m",null,null,null,null,null,null,null,null,null,null,"V01",2]
[null,null,null,null,null,null,null,null,null,"ft",null,null,null,null,null,null,null,null,null,null,"V02",3]
[null,null,null,"V","m","i temp","i","drop","k","dist","L","cable","Vinput",1E-4,null,null,null,null,null,null,"V03",4]
["PS - Imax Vout",15,"60","V","-","A","A","V","-","m","km",null,"V","accuracy",null,null,null,null,null,null,"V04",5]
["Vmin amp.",44,{"$f":"IF(C2=60,66,90)","v":66},60,null,null,null,null,null,null,null,null,null,{"$f":"ABS(SUM(N7:N14))","v":0},null,null,null,null,null,null,"I01",6]
{"$rows_left_out":49}
{"sheet":"Net42","index":2,"n_rows":34,"n_cols":15,"rows_kept":34,"cut":false,"hidden":true,"merged":[[0,7,0,11],[23,2,24,10],[33,5,34,7],[26,12,27,12]]}
[null,{"$f":"SUM(F22:O22)","v":0},null,{"$f":"IF(O21<'AUX2'!B6,1,0)","v":0},{"$f":"+'AUX2'!J5","v":"m"}]
[null,{"$f":"+'AUX2'!M14","v":60},"U start, V",{"$f":"+O5*1","v":0},null,1,2,3,4,5,6,7,8,9,"iteration10"]
[null,null,null,null,"mult.",{"$f":"F6+F5*F4","v":60},{"$f":"G6+G5*G4","v":60},60,60,60,60,60,60,60,60]
[null,null,"cable type","cable",0,{"$f":"VLOOKUP($D4,specs!$K$5:$L$19,2)*IF($E$1=\"m\",$D5,($D5*0.3048))/1000","v":0},{"$f":"VLOOKUP($D4,specs!$K$5:$L$19,2)*IF($E$1=\"m\",$D5,($D5*0.3048))/1000","v":0},{"$f":"VLOOKUP($D4,specs!$K$5:$L$19,2)*IF($E$1=\"m\",$D5,($D5*0.3048))/1000","v":0},{"$f":"VLOOKUP($D4,specs!$K$5:$L$19,2)*IF($E$1=\"m\",$D5,($D5*0.3048))/1000","v":0},{"$f":"VLOOKUP($D4,specs!$K$5:$L$19,2)*IF($E$1=\"m\",$D5,($D5*0.3048))/1000","v":0},{"$f":"VLOOKUP($D4,specs!$K$5:$L$19,2)*IF($E$1=\"m\",$D5,($D5*0.3048))/1000","v":0},{"$f":"VLOOKUP($D4,specs!$K$5:$L$19,2)*IF($E$1=\"m\",$D5,($D5*0.3048))/1000","v":0},{"$f":"VLOOKUP($D4,specs!$K$5:$L$19,2)*IF($E$1=\"m\",$D5,($D5*0.3048))/1000","v":0},{"$f":"VLOOKUP($D4,specs!$K$5:$L$19,2)*IF($E$1=\"m\",$D5,($D5*0.3048))/1000","v":0},{"$f":"VLOOKUP($D4,specs!$K$5:$L$19,2)*IF($E$1=\"m\",$D5,($D5*0.3048))/1000","v":0}]
[null,null,"span length,m",0,0,{"$f":"VLOOKUP($D6,specs!$D$5:$H$17,4)/F6*1.03*$E6+F8","v":0},{"$f":"VLOOKUP($D6,specs!$D$5:$H$17,4)/G6*1.03*$E6+G8","v":0},{"$f":"VLOOKUP($D6,specs!$D$5:$H$17,4)/H6*1.03*$E6+H8","v":0},{"$f":"VLOOKUP($D6,specs!$D$5:$H$17,4)/I6*1.03*$E6+I8","v":0},{"$f":"VLOOKUP($D6,specs!$D$5:$H$17,4)/J6*1.03*$E6+J8","v":0},{"$f":"VLOOKUP($D6,specs!$D$5:$H$17,4)/K6*1.03*$E6+K8","v":0},{"$f":"VLOOKUP($D6,specs!$D$5:$H$17,4)/L6*1.03*$E6+L8","v":0},{"$f":"VLOOKUP($D6,specs!$D$5:$H$17,4)/M6*1.03*$E6+M8","v":0},{"$f":"VLOOKUP($D6,specs!$D$5:$H$17,4)/N6*1.03*$E6+N8","v":0},{"$f":"VLOOKUP($D6,specs!$D$5:$H$17,4)/O6*1.03*$E6+O8","v":0}]
[null,null,"amplifier","load",0,{"$f":"F9+F8*F7","v":60},{"$f":"G9+G8*G7","v":60},60,60,60,60,60,60,60,60]
{"$rows_left_out":29}
{"sheet":"Net41","index":3,"n_rows":34,"n_cols":15,"rows_kept":34,"cut":false,"hidden":true,"merged":[[0,7,0,11],[23,2,24,10],[33,5,34,7],[26,12,27,12]]}
[null,{"$f":"SUM(F22:O22)","v":0},null,{"$f":"IF(O21<'AUX2'!B6,1,0)","v":0},{"$f":"+'AUX2'!J5","v":"m"}]
[null,{"$f":"+'AUX2'!M13","v":60},"U start, V",{"$f":"+O5*1","v":0},null,1,2,3,4,5,6,7,8,9,"iteration10"]
[null,null,null,null,"mult.",{"$f":"F6+F5*F4","v":60},{"$f":"G6+G5*G4","v":60},60,60,60,60,60,60,60,60]
[null,null,"cable type","cable",0,{"$f":"VLOOKUP($D4,specs!$K$5:$L$19,2)*IF($E$1=\"m\",$D5,($D5*0.3048))/1000","v":0},{"$f":"VLOOKUP($D4,specs!$K$5:$L$19,2)*IF($E$1=\"m\",$D5,($D5*0.3048))/1000","v":0},{"$f":"VLOOKUP($D4,specs!$K$5:$L$19,2)*IF($E$1=\"m\",$D5,($D5*0.3048))/1000","v":0},{"$f":"VLOOKUP($D4,specs!$K$5:$L$19,2)*IF($E$1=\"m\",$D5,($D5*0.3048))/1000","v":0},{"$f":"VLOOKUP($D4,specs!$K$5:$L$19,2)*IF($E$1=\"m\",$D5,($D5*0.3048))/1000","v":0},{"$f":"VLOOKUP($D4,specs!$K$5:$L$19,2)*IF($E$1=\"m\",$D5,($D5*0.3048))/1000","v":0},{"$f":"VLOOKUP($D4,specs!$K$5:$L$19,2)*IF($E$1=\"m\",$D5,($D5*0.3048))/1000","v":0},{"$f":"VLOOKUP($D4,specs!$K$5:$L$19,2)*IF($E$1=\"m\",$D5,($D5*0.3048))/1000","v":0},{"$f":"VLOOKUP($D4,specs!$K$5:$L$19,2)*IF($E$1=\"m\",$D5,($D5*0.3048))/1000","v":0},{"$f":"VLOOKUP($D4,specs!$K$5:$L$19,2)*IF($E$1=\"m\",$D5,($D5*0.3048))/1000","v":0}]
[null,null,"span length,m",0,0,{"$f":"VLOOKUP($D6,specs!$D$5:$H$17,4)/F6*1.03*$E6+F8","v":0},{"$f":"VLOOKUP($D6,specs!$D$5:$H$17,4)/G6*1.03*$E6+G8","v":0},{"$f":"VLOOKUP($D6,specs!$D$5:$H$17,4)/H6*1.03*$E6+H8","v":0},{"$f":"VLOOKUP($D6,specs!$D$5:$H$17,4)/I6*1.03*$E6+I8","v":0},{"$f":"VLOOKUP($D6,specs!$D$5:$H$17,4)/J6*1.03*$E6+J8","v":0},{"$f":"VLOOKUP($D6,specs!$D$5:$H$17,4)/K6*1.03*$E6+K8","v":0},{"$f":"VLOOKUP($D6,specs!$D$5:$H$17,4)/L6*1.03*$E6+L8","v":0},{"$f":"VLOOKUP($D6,specs!$D$5:$H$17,4)/M6*1.03*$E6+M8","v":0},{"$f":"VLOOKUP($D6,specs!$D$5:$H$17,4)/N6*1.03*$E6+N8","v":0},{"$f":"VLOOKUP($D6,specs!$D$5:$H$17,4)/O6*1.03*$E6+O8","v":0}]
[null,null,"amplifier","load",0,{"$f":"F9+F8*F7","v":60},{"$f":"G9+G8*G7","v":60},60,60,60,60,60,60,60,60]
{"$rows_left_out":29}
{"sheet":"Net32","index":4,"n_rows":34,"n_cols":15,"rows_kept":34,"cut":false,"hidden":true,"merged":[[0,7,0,11],[23,2,24,10],[33,5,34,7],[26,12,27,12]]}
[null,{"$f":"SUM(F22:O22)","v":0},null,{"$f":"IF(O21<'AUX2'!B6,1,0)","v":0},{"$f":"+'AUX2'!J5","v":"m"}]
[null,{"$f":"'AUX2'!M12","v":60},"U start, V",{"$f":"+O5*1","v":0},null,1,2,3,4,5,6,7,8,9,"iteration10"]
[null,null,null,null,"mult.",{"$f":"F6+F5*F4","v":60},{"$f":"G6+G5*G4","v":60},60,60,60,60,60,60,60,60]
[null,null,"cable type","cable",0,{"$f":"VLOOKUP($D4,specs!$K$5:$L$19,2)*IF($E$1=\"m\",$D5,($D5*0.3048))/1000","v":0},{"$f":"VLOOKUP($D4,specs!$K$5:$L$19,2)*IF($E$1=\"m\",$D5,($D5*0.3048))/1000","v":0},{"$f":"VLOOKUP($D4,specs!$K$5:$L$19,2)*IF($E$1=\"m\",$D5,($D5*0.3048))/1000","v":0},{"$f":"VLOOKUP($D4,specs!$K$5:$L$19,2)*IF($E$1=\"m\",$D5,($D5*0.3048))/1000","v":0},{"$f":"VLOOKUP($D4,specs!$K$5:$L$19,2)*IF($E$1=\"m\",$D5,($D5*0.3048))/1000","v":0},{"$f":"VLOOKUP($D4,specs!$K$5:$L$19,2)*IF($E$1=\"m\",$D5,($D5*0.3048))/1000","v":0},{"$f":"VLOOKUP($D4,specs!$K$5:$L$19,2)*IF($E$1=\"m\",$D5,($D5*0.3048))/1000","v":0},{"$f":"VLOOKUP($D4,specs!$K$5:$L$19,2)*IF($E$1=\"m\",$D5,($D5*0.3048))/1000","v":0},{"$f":"VLOOKUP($D4,specs!$K$5:$L$19,2)*IF($E$1=\"m\",$D5,($D5*0.3048))/1000","v":0},{"$f":"VLOOKUP($D4,specs!$K$5:$L$19,2)*IF($E$1=\"m\",$D5,($D5*0.3048))/1000","v":0}]
[null,null,"span length,m",0,0,{"$f":"VLOOKUP($D6,specs!$D$5:$H$17,4)/F6*1.03*$E6+F8","v":0},{"$f":"VLOOKUP($D6,specs!$D$5:$H$17,4)/G6*1.03*$E6+G8","v":0},{"$f":"VLOOKUP($D6,specs!$D$5:$H$17,4)/H6*1.03*$E6+H8","v":0},{"$f":"VLOOKUP($D6,specs!$D$5:$H$17,4)/I6*1.03*$E6+I8","v":0},{"$f":"VLOOKUP($D6,specs!$D$5:$H$17,4)/J6*1.03*$E6+J8","v":0},{"$f":"VLOOKUP($D6,specs!$D$5:$H$17,4)/K6*1.03*$E6+K8","v":0},{"$f":"VLOOKUP($D6,specs!$D$5:$H$17,4)/L6*1.03*$E6+L8","v":0},{"$f":"VLOOKUP($D6,specs!$D$5:$H$17,4)/M6*1.03*$E6+M8","v":0},{"$f":"VLOOKUP($D6,specs!$D$5:$H$17,4)/N6*1.03*$E6+N8","v":0},{"$f":"VLOOKUP($D6,specs!$D$5:$H$17,4)/O6*1.03*$E6+O8","v":0}]
[null,null,"amplifier","load",0,{"$f":"F9+F8*F7","v":60},{"$f":"G9+G8*G7","v":60},60,60,60,60,60,60,60,60]
{"$rows_left_out":29}
{"sheet":"Net31","index":5,"n_rows":34,"n_cols":15,"rows_kept":34,"cut":false,"hidden":true,"merged":[[0,7,0,11],[23,2,24,10],[33,5,34,7],[26,12,27,12]]}
[null,{"$f":"SUM(F22:O22)","v":0},null,{"$f":"IF(O21<'AUX2'!B6,1,0)","v":0},{"$f":"+'AUX2'!J5","v":"m"}]
[null,{"$f":"+'AUX2'!M11","v":60},"U start, V",{"$f":"+O5*1","v":0},null,1,2,3,4,5,6,7,8,9,"iteration10"]
[null,null,null,null,"mult.",{"$f":"F6+F5*F4","v":60},{"$f":"G6+G5*G4","v":60},60,60,60,60,60,60,60,60]
[null,null,"cable type","cable",0,{"$f":"VLOOKUP($D4,specs!$K$5:$L$19,2)*IF($E$1=\"m\",$D5,($D5*0.3048))/1000","v":0},{"$f":"VLOOKUP($D4,specs!$K$5:$L$19,2)*IF($E$1=\"m\",$D5,($D5*0.3048))/1000","v":0},{"$f":"VLOOKUP($D4,specs!$K$5:$L$19,2)*IF($E$1=\"m\",$D5,($D5*0.3048))/1000","v":0},{"$f":"VLOOKUP($D4,specs!$K$5:$L$19,2)*IF($E$1=\"m\",$D5,($D5*0.3048))/1000","v":0},{"$f":"VLOOKUP($D4,specs!$K$5:$L$19,2)*IF($E$1=\"m\",$D5,($D5*0.3048))/1000","v":0},{"$f":"VLOOKUP($D4,specs!$K$5:$L$19,2)*IF($E$1=\"m\",$D5,($D5*0.3048))/1000","v":0},{"$f":"VLOOKUP($D4,specs!$K$5:$L$19,2)*IF($E$1=\"m\",$D5,($D5*0.3048))/1000","v":0},{"$f":"VLOOKUP($D4,specs!$K$5:$L$19,2)*IF($E$1=\"m\",$D5,($D5*0.3048))/1000","v":0},{"$f":"VLOOKUP($D4,specs!$K$5:$L$19,2)*IF($E$1=\"m\",$D5,($D5*0.3048))/1000","v":0},{"$f":"VLOOKUP($D4,specs!$K$5:$L$19,2)*IF($E$1=\"m\",$D5,($D5*0.3048))/1000","v":0}]
[null,null,"span length,m",0,0,{"$f":"VLOOKUP($D6,specs!$D$5:$H$17,4)/F6*1.03*$E6+F8","v":0},{"$f":"VLOOKUP($D6,specs!$D$5:$H$17,4)/G6*1.03*$E6+G8","v":0},{"$f":"VLOOKUP($D6,specs!$D$5:$H$17,4)/H6*1.03*$E6+H8","v":0},{"$f":"VLOOKUP($D6,specs!$D$5:$H$17,4)/I6*1.03*$E6+I8","v":0},{"$f":"VLOOKUP($D6,specs!$D$5:$H$17,4)/J6*1.03*$E6+J8","v":0},{"$f":"VLOOKUP($D6,specs!$D$5:$H$17,4)/K6*1.03*$E6+K8","v":0},{"$f":"VLOOKUP($D6,specs!$D$5:$H$17,4)/L6*1.03*$E6+L8","v":0},{"$f":"VLOOKUP($D6,specs!$D$5:$H$17,4)/M6*1.03*$E6+M8","v":0},{"$f":"VLOOKUP($D6,specs!$D$5:$H$17,4)/N6*1.03*$E6+N8","v":0},{"$f":"VLOOKUP($D6,specs!$D$5:$H$17,4)/O6*1.03*$E6+O8","v":0}]
[null,null,"amplifier","load",0,{"$f":"F9+F8*F7","v":60},{"$f":"G9+G8*G7","v":60},60,60,60,60,60,60,60,60]
{"$rows_left_out":29}
{"sheet":"Net22","index":6,"n_rows":34,"n_cols":15,"rows_kept":34,"cut":false,"hidden":true,"merged":[[0,7,0,11],[23,2,24,10],[33,5,34,7],[26,12,27,12]]}
[null,{"$f":"SUM(F22:O22)","v":0},null,{"$f":"IF(O21<'AUX2'!B6,1,0)","v":0},{"$f":"+'AUX2'!J5","v":"m"}]
[null,{"$f":"+'AUX2'!M10","v":60},"U start, V",{"$f":"+O5*1","v":0},null,1,2,3,4,5,6,7,8,9,"iteration10"]
[null,null,null,null,"mult.",{"$f":"F6+F5*F4","v":60},{"$f":"G6+G5*G4","v":60},60,60,60,60,60,60,60,60]
[null,null,"cable type","cable",0,{"$f":"VLOOKUP($D4,specs!$K$5:$L$19,2)*IF($E$1=\"m\",$D5,($D5*0.3048))/1000","v":0},{"$f":"VLOOKUP($D4,specs!$K$5:$L$19,2)*IF($E$1=\"m\",$D5,($D5*0.3048))/1000","v":0},{"$f":"VLOOKUP($D4,specs!$K$5:$L$19,2)*IF($E$1=\"m\",$D5,($D5*0.3048))/1000","v":0},{"$f":"VLOOKUP($D4,specs!$K$5:$L$19,2)*IF($E$1=\"m\",$D5,($D5*0.3048))/1000","v":0},{"$f":"VLOOKUP($D4,specs!$K$5:$L$19,2)*IF($E$1=\"m\",$D5,($D5*0.3048))/1000","v":0},{"$f":"VLOOKUP($D4,specs!$K$5:$L$19,2)*IF($E$1=\"m\",$D5,($D5*0.3048))/1000","v":0},{"$f":"VLOOKUP($D4,specs!$K$5:$L$19,2)*IF($E$1=\"m\",$D5,($D5*0.3048))/1000","v":0},{"$f":"VLOOKUP($D4,specs!$K$5:$L$19,2)*IF($E$1=\"m\",$D5,($D5*0.3048))/1000","v":0},{"$f":"VLOOKUP($D4,specs!$K$5:$L$19,2)*IF($E$1=\"m\",$D5,($D5*0.3048))/1000","v":0},{"$f":"VLOOKUP($D4,specs!$K$5:$L$19,2)*IF($E$1=\"m\",$D5,($D5*0.3048))/1000","v":0}]
[null,null,"span length,m",0,0,{"$f":"VLOOKUP($D6,specs!$D$5:$H$17,4)/F6*1.03*$E6+F8","v":0},{"$f":"VLOOKUP($D6,specs!$D$5:$H$17,4)/G6*1.03*$E6+G8","v":0},{"$f":"VLOOKUP($D6,specs!$D$5:$H$17,4)/H6*1.03*$E6+H8","v":0},{"$f":"VLOOKUP($D6,specs!$D$5:$H$17,4)/I6*1.03*$E6+I8","v":0},{"$f":"VLOOKUP($D6,specs!$D$5:$H$17,4)/J6*1.03*$E6+J8","v":0},{"$f":"VLOOKUP($D6,specs!$D$5:$H$17,4)/K6*1.03*$E6+K8","v":0},{"$f":"VLOOKUP($D6,specs!$D$5:$H$17,4)/L6*1.03*$E6+L8","v":0},{"$f":"VLOOKUP($D6,specs!$D$5:$H$17,4)/M6*1.03*$E6+M8","v":0},{"$f":"VLOOKUP($D6,specs!$D$5:$H$17,4)/N6*1.03*$E6+N8","v":0},{"$f":"VLOOKUP($D6,specs!$D$5:$H$17,4)/O6*1.03*$E6+O8","v":0}]
[null,null,"amplifier","load",0,{"$f":"F9+F8*F7","v":60},{"$f":"G9+G8*G7","v":60},60,60,60,60,60,60,60,60]
{"$rows_left_out":29}
{"sheet":"Net21","index":7,"n_rows":34,"n_cols":15,"rows_kept":34,"cut":false,"hidden":true,"merged":[[0,7,0,11],[23,2,24,10],[33,5,34,7],[26,12,27,12]]}
[null,{"$f":"SUM(F22:O22)","v":0},null,{"$f":"IF(O21<'AUX2'!B6,1,0)","v":0},{"$f":"+'AUX2'!J5","v":"m"}]
[null,{"$f":"+'AUX2'!M9","v":60},"U start, V",{"$f":"+O5*1","v":0},null,1,2,3,4,5,6,7,8,9,"iteration10"]
[null,null,null,null,"mult.",{"$f":"F6+F5*F4","v":60},{"$f":"G6+G5*G4","v":60},60,60,60,60,60,60,60,60]
[null,null,"cable type","cable",0,{"$f":"VLOOKUP($D4,specs!$K$5:$L$19,2)*IF($E$1=\"m\",$D5,($D5*0.3048))/1000","v":0},{"$f":"VLOOKUP($D4,specs!$K$5:$L$19,2)*IF($E$1=\"m\",$D5,($D5*0.3048))/1000","v":0},{"$f":"VLOOKUP($D4,specs!$K$5:$L$19,2)*IF($E$1=\"m\",$D5,($D5*0.3048))/1000","v":0},{"$f":"VLOOKUP($D4,specs!$K$5:$L$19,2)*IF($E$1=\"m\",$D5,($D5*0.3048))/1000","v":0},{"$f":"VLOOKUP($D4,specs!$K$5:$L$19,2)*IF($E$1=\"m\",$D5,($D5*0.3048))/1000","v":0},{"$f":"VLOOKUP($D4,specs!$K$5:$L$19,2)*IF($E$1=\"m\",$D5,($D5*0.3048))/1000","v":0},{"$f":"VLOOKUP($D4,specs!$K$5:$L$19,2)*IF($E$1=\"m\",$D5,($D5*0.3048))/1000","v":0},{"$f":"VLOOKUP($D4,specs!$K$5:$L$19,2)*IF($E$1=\"m\",$D5,($D5*0.3048))/1000","v":0},{"$f":"VLOOKUP($D4,specs!$K$5:$L$19,2)*IF($E$1=\"m\",$D5,($D5*0.3048))/1000","v":0},{"$f":"VLOOKUP($D4,specs!$K$5:$L$19,2)*IF($E$1=\"m\",$D5,($D5*0.3048))/1000","v":0}]
[null,null,"span length,m",0,0,{"$f":"VLOOKUP($D6,specs!$D$5:$H$17,4)/F6*1.03*$E6+F8","v":0},{"$f":"VLOOKUP($D6,specs!$D$5:$H$17,4)/G6*1.03*$E6+G8","v":0},{"$f":"VLOOKUP($D6,specs!$D$5:$H$17,4)/H6*1.03*$E6+H8","v":0},{"$f":"VLOOKUP($D6,specs!$D$5:$H$17,4)/I6*1.03*$E6+I8","v":0},{"$f":"VLOOKUP($D6,specs!$D$5:$H$17,4)/J6*1.03*$E6+J8","v":0},{"$f":"VLOOKUP($D6,specs!$D$5:$H$17,4)/K6*1.03*$E6+K8","v":0},{"$f":"VLOOKUP($D6,specs!$D$5:$H$17,4)/L6*1.03*$E6+L8","v":0},{"$f":"VLOOKUP($D6,specs!$D$5:$H$17,4)/M6*1.03*$E6+M8","v":0},{"$f":"VLOOKUP($D6,specs!$D$5:$H$17,4)/N6*1.03*$E6+N8","v":0},{"$f":"VLOOKUP($D6,specs!$D$5:$H$17,4)/O6*1.03*$E6+O8","v":0}]
[null,null,"amplifier","load",0,{"$f":"F9+F8*F7","v":60},{"$f":"G9+G8*G7","v":60},60,60,60,60,60,60,60,60]
{"$rows_left_out":29}
{"sheet":"Net12","index":8,"n_rows":34,"n_cols":15,"rows_kept":34,"cut":false,"hidden":true,"merged":[[0,7,0,11],[23,2,24,10],[33,5,34,7],[26,12,27,12]]}
[null,{"$f":"SUM(F22:O22)","v":0},null,{"$f":"IF(O21<'AUX2'!B6,1,0)","v":0},{"$f":"+'AUX2'!J5","v":"m"}]
[null,{"$f":"+'AUX2'!M8","v":60},"U start, V",{"$f":"+O5*1","v":0},null,1,2,3,4,5,6,7,8,9,"iteration10"]
[null,null,null,null,"mult.",{"$f":"F6+F5*F4","v":60},{"$f":"G6+G5*G4","v":60},60,60,60,60,60,60,60,60]
[null,null,"cable type","cable",0,{"$f":"VLOOKUP($D4,specs!$K$5:$L$19,2)*IF($E$1=\"m\",$D5,($D5*0.3048))/1000","v":0},{"$f":"VLOOKUP($D4,specs!$K$5:$L$19,2)*IF($E$1=\"m\",$D5,($D5*0.3048))/1000","v":0},{"$f":"VLOOKUP($D4,specs!$K$5:$L$19,2)*IF($E$1=\"m\",$D5,($D5*0.3048))/1000","v":0},{"$f":"VLOOKUP($D4,specs!$K$5:$L$19,2)*IF($E$1=\"m\",$D5,($D5*0.3048))/1000","v":0},{"$f":"VLOOKUP($D4,specs!$K$5:$L$19,2)*IF($E$1=\"m\",$D5,($D5*0.3048))/1000","v":0},{"$f":"VLOOKUP($D4,specs!$K$5:$L$19,2)*IF($E$1=\"m\",$D5,($D5*0.3048))/1000","v":0},{"$f":"VLOOKUP($D4,specs!$K$5:$L$19,2)*IF($E$1=\"m\",$D5,($D5*0.3048))/1000","v":0},{"$f":"VLOOKUP($D4,specs!$K$5:$L$19,2)*IF($E$1=\"m\",$D5,($D5*0.3048))/1000","v":0},{"$f":"VLOOKUP($D4,specs!$K$5:$L$19,2)*IF($E$1=\"m\",$D5,($D5*0.3048))/1000","v":0},{"$f":"VLOOKUP($D4,specs!$K$5:$L$19,2)*IF($E$1=\"m\",$D5,($D5*0.3048))/1000","v":0}]
[null,null,"span length,m",0,0,{"$f":"VLOOKUP($D6,specs!$D$5:$H$17,4)/F6*1.03*$E6+F8","v":0},{"$f":"VLOOKUP($D6,specs!$D$5:$H$17,4)/G6*1.03*$E6+G8","v":0},{"$f":"VLOOKUP($D6,specs!$D$5:$H$17,4)/H6*1.03*$E6+H8","v":0},{"$f":"VLOOKUP($D6,specs!$D$5:$H$17,4)/I6*1.03*$E6+I8","v":0},{"$f":"VLOOKUP($D6,specs!$D$5:$H$17,4)/J6*1.03*$E6+J8","v":0},{"$f":"VLOOKUP($D6,specs!$D$5:$H$17,4)/K6*1.03*$E6+K8","v":0},{"$f":"VLOOKUP($D6,specs!$D$5:$H$17,4)/L6*1.03*$E6+L8","v":0},{"$f":"VLOOKUP($D6,specs!$D$5:$H$17,4)/M6*1.03*$E6+M8","v":0},{"$f":"VLOOKUP($D6,specs!$D$5:$H$17,4)/N6*1.03*$E6+N8","v":0},{"$f":"VLOOKUP($D6,specs!$D$5:$H$17,4)/O6*1.03*$E6+O8","v":0}]
[null,null,"amplifier","load",0,{"$f":"F9+F8*F7","v":60},{"$f":"G9+G8*G7","v":60},60,60,60,60,60,60,60,60]
{"$rows_left_out":29}
{"sheet":"Net11","index":9,"n_rows":34,"n_cols":15,"rows_kept":34,"cut":false,"hidden":true,"merged":[[0,7,0,11],[23,2,24,10],[33,5,34,7],[26,12,27,12]]}
[null,{"$f":"SUM(F22:O22)","v":0},null,{"$f":"IF(O21<'AUX2'!B6,1,0)","v":0},{"$f":"+'AUX2'!J5","v":"m"}]
[null,{"$f":"+'AUX2'!M7","v":60},"U start, V",{"$f":"+O5*1","v":0},null,1,2,3,4,5,6,7,8,9,"iteration10"]
[null,null,null,null,"mult.",{"$f":"F6+F5*F4","v":60},{"$f":"G6+G5*G4","v":60},60,60,60,60,60,60,60,{"$f":"O6+O5*O4","v":60}]
[null,null,"cable type","cable",0,{"$f":"VLOOKUP($D4,specs!$K$5:$L$19,2)*IF($E$1=\"m\",$D5,($D5*0.3048))/1000","v":0},{"$f":"VLOOKUP($D4,specs!$K$5:$L$19,2)*IF($E$1=\"m\",$D5,($D5*0.3048))/1000","v":0},{"$f":"VLOOKUP($D4,specs!$K$5:$L$19,2)*IF($E$1=\"m\",$D5,($D5*0.3048))/1000","v":0},{"$f":"VLOOKUP($D4,specs!$K$5:$L$19,2)*IF($E$1=\"m\",$D5,($D5*0.3048))/1000","v":0},{"$f":"VLOOKUP($D4,specs!$K$5:$L$19,2)*IF($E$1=\"m\",$D5,($D5*0.3048))/1000","v":0},{"$f":"VLOOKUP($D4,specs!$K$5:$L$19,2)*IF($E$1=\"m\",$D5,($D5*0.3048))/1000","v":0},{"$f":"VLOOKUP($D4,specs!$K$5:$L$19,2)*IF($E$1=\"m\",$D5,($D5*0.3048))/1000","v":0},{"$f":"VLOOKUP($D4,specs!$K$5:$L$19,2)*IF($E$1=\"m\",$D5,($D5*0.3048))/1000","v":0},{"$f":"VLOOKUP($D4,specs!$K$5:$L$19,2)*IF($E$1=\"m\",$D5,($D5*0.3048))/1000","v":0},{"$f":"VLOOKUP($D4,specs!$K$5:$L$19,2)*IF($E$1=\"m\",$D5,($D5*0.3048))/1000","v":0}]
[null,null,"span length,m",0,0,{"$f":"VLOOKUP($D6,specs!$D$5:$H$17,4)/F6*1.03*$E6+F8","v":0},{"$f":"VLOOKUP($D6,specs!$D$5:$H$17,4)/G6*1.03*$E6+G8","v":0},{"$f":"VLOOKUP($D6,specs!$D$5:$H$17,4)/H6*1.03*$E6+H8","v":0},{"$f":"VLOOKUP($D6,specs!$D$5:$H$17,4)/I6*1.03*$E6+I8","v":0},{"$f":"VLOOKUP($D6,specs!$D$5:$H$17,4)/J6*1.03*$E6+J8","v":0},{"$f":"VLOOKUP($D6,specs!$D$5:$H$17,4)/K6*1.03*$E6+K8","v":0},{"$f":"VLOOKUP($D6,specs!$D$5:$H$17,4)/L6*1.03*$E6+L8","v":0},{"$f":"VLOOKUP($D6,specs!$D$5:$H$17,4)/M6*1.03*$E6+M8","v":0},{"$f":"VLOOKUP($D6,specs!$D$5:$H$17,4)/N6*1.03*$E6+N8","v":0},{"$f":"VLOOKUP($D6,specs!$D$5:$H$17,4)/O6*1.03*$E6+O8","v":0}]
[null,null,"amplifier","load",0,{"$f":"F9+F8*F7","v":60},{"$f":"G9+G8*G7","v":60},60,60,60,60,60,60,60,{"$f":"O9+O8*O7","v":60}]
{"$rows_left_out":29}
{"sheet":"AUX","index":10,"n_rows":13,"n_cols":27,"rows_kept":13,"cut":false,"hidden":true,"merged":[[1,3,1,5],[1,7,1,9]]}
[]
[null,null,null,"R,Ohm",null,null,null,"Vdrop,V"]
[null,"length,m","I,A",540,860,750,"3x10",540,860,750,"3x10","amp type","Inom,A","Vnom,V","Pnom,W","factor_i","cable","loop_res",null,null,null,null,null,null,null,null,"LIST"]
[1,null,null,{"$f":"B4*$R$4","v":0},{"$f":"B4*$R$5","v":0},{"$f":"B4*$R$6","v":0},{"$f":"+B4*$R$7","v":0},{"$f":"$C4*D4","v":0},{"$f":"$C4*E4","v":0},{"$f":"$C4*F4","v":0},{"$f":"$C4*G4","v":0},"HLN",1.4,60,84,{"$f":"M4/(O4/N4)","v":1},"QR540",{"$f":"S4/1000","v":5.28E-3},5.28,"C500",{"$f":"V4/1000","v":5.64E-3},5.64,null,null,null,null,"Net11"]
[2,null,null,0,0,0,{"$f":"+B5*$R$7","v":0},{"$f":"$C5*D5","v":0},{"$f":"$C5*E5","v":0},{"$f":"$C5*F5","v":0},{"$f":"$C5*G5","v":0},"TNA",1,60,60,{"$f":"M5/(O5/N5)","v":1},"QR860",{"$f":"S5/1000","v":2.3700000000000001E-3},2.37,"C625",{"$f":"V5/1000","v":3.6099999999999999E-3},3.61,null,null,null,null,"Net12"]
[3,null,null,0,0,0,{"$f":"+B6*$R$7","v":0},0,0,0,0,"LEX",0.5,60,36,{"$f":"M6/(O6/N6)","v":0.83333333333333337},"C750",{"$f":"S6/1000","v":2.49E-3},2.4900000000000002,null,null,null,null,null,null,null,"Net21"]
{"$rows_left_out":8}
{"sheet":"specs","index":11,"n_rows":35,"n_cols":15,"rows_kept":35,"cut":false,"hidden":false,"merged":[[19,10,20,13],[21,3,21,4],[21,5,21,6]]}
[]
[]
[null,null,null,1,2,3,4,5,null,null,1,2]
[null,null,"amp type","sorted","Inom,A","Vnom,V","Pnom,W",null,"original","cable","sorted","loop_res",null,null,"original"]
[null,null,"load","DBLE",null,60,30,1,30,"cable","2x10",3.66,"cable",1,3.66]
[null,null,"HLN","future1",null,60,0,1,0,"QR860","2x6",6,"QR860",2,6]
{"$rows_left_out":29}